{"text_format":"1","workbook":"xlsx","n_sheets":5,"sheets":["Feuil1","Feuil2","Feuil3","Feuil4","Feuil5"],"not_rendered":{"charts":0,"images":1,"macros":1,"external_links":0,"defined_names":13,"comments":0,"pivot_tables":0},"unopened":[],"bounds":{"document_bytes":16777216,"sheet_cells":100000,"rows_first":2000,"rows_last":500,"rows_between":2000,"halvings":0,"cell_chars":16384,"cell_head_chars":4096},"cells_cut":0,"cells_raw":0,"read":"whole","date_system":"1900"}

{"sheet":"Feuil1","index":0,"n_rows":304,"n_cols":37,"rows_kept":304,"cut":false,"hidden":false,"merged":[[36,36,36,38],[29,36,29,38],[30,14,30,16],[31,14,31,16],[21,32,21,34],[22,32,22,34],[18,32,18,34],[19,32,19,34],[20,32,20,34],[24,32,24,34],[25,32,25,34],[26,32,26,34],[27,32,27,34],[35,32,35,34],[36,32,36,34],[33,32,33,34],[34,32,34,34],[8,14,8,16],[9,14,9,16],[30,32,30,34],[31,32,31,34],[32,32,32,34],[0,31,0,39],[10,0,10,2],[10,18,10,26],[10,4,10,12],[10,14,10,16],[23,32,23,34],[10,31,11,39],[12,31,13,39],[28,36,28,38],[9,4,9,12],[3,2,3,4],[8,4,8,12],[8,18,8,26],[9,18,9,26],[8,0,8,2],[9,0,9,2],[28,32,28,34],[29,32,29,34],[57,32,57,34],[48,32,48,34],[49,32,49,34],[50,32,50,34],[51,32,51,34],[52,32,52,34],[53,32,53,34],[54,32,54,34],[55,32,55,34],[56,32,56,34],[47,32,47,34],[38,32,38,34],[39,32,39,34],[40,32,40,34],[41,32,41,34],[43,32,43,34],[42,32,42,34],[44,32,44,34],[37,32,37,34],[45,32,45,34],[46,32,46,34],[67,32,67,34],[58,32,58,34],[59,32,59,34],[60,32,60,34],[61,32,61,34],[62,32,62,34],[63,32,63,34],[64,32,64,34],[88,32,88,34],[77,32,77,34],[68,32,68,34],[69,32,69,34],[70,32,70,34],[71,32,71,34],[72,32,72,34],[73,32,73,34],[74,32,74,34],[75,32,75,34],[76,32,76,34],[66,32,66,34],[65,32,65,34],[89,32,89,34],[90,32,90,34],[91,32,91,34],[87,32,87,34],[78,32,78,34],[79,32,79,34],[80,32,80,34],[81,32,81,34],[82,32,82,34],[83,32,83,34],[84,32,84,34],[85,32,85,34],[86,32,86,34],[96,32,96,34],[98,32,98,34],[99,32,99,34],[100,32,100,34],[97,32,97,34],[92,32,92,34],[93,32,93,34],[94,32,94,34],[95,32,95,34],[103,32,103,34],[104,32,104,34],[105,32,105,34],[107,32,107,34],[101,32,101,34],[106,32,106,34],[117,32,117,34],[108,32,108,34],[109,32,109,34],[110,32,110,34],[111,32,111,34],[116,32,116,34],[112,32,112,34],[113,32,113,34],[114,32,114,34],[115,32,115,34],[118,32,118,34],[119,32,119,34],[120,32,120,34],[121,32,121,34],[123,32,123,34],[122,32,122,34],[32,36,32,38],[33,36,33,38],[45,36,45,38],[46,36,46,38],[47,36,47,38],[102,32,102,34],[37,36,37,38],[38,36,38,38],[41,36,41,38],[42,36,42,38],[43,36,43,38],[44,36,44,38],[48,36,48,38],[67,36,67,38],[68,36,68,38],[66,36,66,38],[39,36,39,38],[79,36,79,38],[154,32,154,34],[155,32,155,34],[144,32,144,34],[145,32,145,34],[146,32,146,34],[147,32,147,34],[129,32,129,34],[124,32,124,34],[125,32,125,34],[126,32,126,34],[153,32,153,34],[137,32,137,34],[128,32,128,34],[134,32,134,34],[135,32,135,34],[136,32,136,34],[127,32,127,34],[130,32,130,34],[131,32,131,34],[132,32,132,34],[133,32,133,34],[159,32,159,34],[18,36,18,38],[19,36,19,38],[20,36,20,38],[21,36,21,38],[22,36,22,38],[23,36,23,38],[24,36,24,38],[30,36,30,38],[31,36,31,38],[158,32,158,34],[140,32,140,34],[141,32,141,34],[151,32,151,34],[152,32,152,34],[157,32,157,34],[25,36,25,38],[26,36,26,38],[27,36,27,38],[40,36,40,38],[138,32,138,34],[139,32,139,34],[34,36,34,38],[35,36,35,38],[156,32,156,34],[148,32,148,34],[149,32,149,34],[150,32,150,34],[143,32,143,34],[142,32,142,34],[56,36,56,38],[49,36,49,38],[59,36,59,38],[50,36,50,38],[51,36,51,38],[52,36,52,38],[53,36,53,38],[54,36,54,38],[55,36,55,38],[57,36,57,38],[58,36,58,38],[69,36,69,38],[60,36,60,38],[61,36,61,38],[62,36,62,38],[63,36,63,38],[64,36,64,38],[65,36,65,38],[70,36,70,38],[71,36,71,38],[72,36,72,38],[73,36,73,38],[74,36,74,38],[75,36,75,38],[76,36,76,38],[77,36,77,38],[78,36,78,38],[89,36,89,38],[80,36,80,38],[81,36,81,38],[82,36,82,38],[83,36,83,38],[84,36,84,38],[85,36,85,38],[86,36,86,38],[87,36,87,38],[88,36,88,38],[99,36,99,38],[90,36,90,38],[91,36,91,38],[92,36,92,38],[93,36,93,38],[94,36,94,38],[95,36,95,38],[96,36,96,38],[97,36,97,38],[98,36,98,38],[109,36,109,38],[100,36,100,38],[101,36,101,38],[102,36,102,38],[103,36,103,38],[104,36,104,38],[105,36,105,38],[106,36,106,38],[107,36,107,38],[108,36,108,38],[119,36,119,38],[110,36,110,38],[111,36,111,38],[112,36,112,38],[113,36,113,38],[114,36,114,38],[115,36,115,38],[116,36,116,38],[117,36,117,38],[118,36,118,38],[129,36,129,38],[120,36,120,38],[121,36,121,38],[122,36,122,38],[123,36,123,38],[124,36,124,38],[125,36,125,38],[126,36,126,38],[127,36,127,38],[128,36,128,38],[139,36,139,38],[130,36,130,38],[131,36,131,38],[132,36,132,38],[133,36,133,38],[134,36,134,38],[135,36,135,38],[136,36,136,38],[137,36,137,38],[138,36,138,38],[149,36,149,38],[140,36,140,38],[141,36,141,38],[142,36,142,38],[143,36,143,38],[144,36,144,38],[145,36,145,38],[146,36,146,38],[147,36,147,38],[148,36,148,38],[159,36,159,38],[150,36,150,38],[151,36,151,38],[152,36,152,38],[153,36,153,38],[154,36,154,38],[155,36,155,38],[156,36,156,38],[157,36,157,38],[158,36,158,38]]}
["Fédération Sportive et Gymnique du Travail",null,null,null,null,null,null,null,null,null,null,null,null,null,null,null,null,null,null,null,null,null,null,null,null,null,null,null,null,null,null,"IMPORTANT : Le fichier téléchargé sur le site du comité doit être enregistré sur le disque dur ou sur une clé USB sans changer le nom avant toute saisie ; EXCEL doit être fermé avant toute ouverture du fichier feuille de match"]
["Championnat par équipes",null,null,null,null,null,null,null,null,null,"D",{"$f":"IF(ISBLANK(P4),\" \",P4)","v":1},null,null,null,null,null,null,null,null,null,null,null,null,null,null,null,null,null,null,"Notice :","Sélectionner la division, la phase et la journée à l'aide de la liste déroulante"]
[null,"Date :",{"$f":"IF(ISBLANK(X4),\" \",LOOKUP(X4,Feuil2!D2:D20,Feuil2!E2:E20))","v":"2023-09-28"},null,null,null,null,null,null,"Heure officielle :",{"$f":"IF(ISBLANK(M3),\" \",VLOOKUP(M3,Horaires,2,FALSE))","v":"18H30"},null,13,null,null,null,null,null,null,null,null,null,null,null,null,null,null,null,null,null,null,"Saisir la date dans la cellule C4"]
[null,"Date réelle :",null,null,null,null,null,null,null,"Heure réelle :",{"$f":"IF(ISBLANK(M4),\" \",VLOOKUP(M4,Horaires,2,FALSE))","v":"19H00"},null,19,null,"Division :",1,null,null,"Phase :",1,null,null,"Journée :",1,null,null,null,null,null,null,null,"Sélectionner l'heure officieelle, l'heure réelle et le lieu à l'aide de la liste déroulante (facultatif)"]
[null,"Lieu :",{"$f":"IF(ISBLANK(O5),\" \",VLOOKUP(O5,Lieux,2,FALSE))","v":{"$error":"#N/A"}},null,null,null,null,null,null,null,null,null,null,null,15,null,null,null,null,null,null,null,null,null,null,null,null,{"$f":"HYPERLINK(\"mailto:fdm-tennis-de-table@fsgt75.org\",\"fdm-tennis-de-table@fsgt75.org\")","v":"fdm-tennis-de-table@fsgt75.org"},null,null,null,"Sélectionner les 2 clubs et leurs N° à l'aide de la liste déroulante et cliquer sur le bouton Liste des joueurs"]
[null,null,null,null,null,null,null,null,null,null,null,null,null,null,null,null,null,null,null,null,null,null,null,null,null,null,null,null,null,null,null,"Faire un copier/collage spécial valeurs des N° de licences par joueur depuis la liste affichée ci-dessous"]
[{"$f":"IF(ISBLANK(G7),\" \",VLOOKUP(G7,ordreclubs,2,FALSE))","v":0},null,"Club :",{"$f":"IF(ISBLANK(G7),\" \",VLOOKUP(G7,ordreclubs,2,FALSE))","v":0},null,null,1,null,"N°",1,null,null,null,null,{"$f":"IF(ISBLANK(U7),\" \",VLOOKUP(U7,ordreclubs,2,FALSE))","v":0},null,"Club :",{"$f":"IF(ISBLANK(U7),\" \",VLOOKUP(U7,ordreclubs,2,FALSE))","v":0},null,null,1,null,"N°",1,null,null,null,null,null,null,null,"Ou saisir le 1er N° de licence dans la cellule A9"]
[null,"Licence",null,5,"NOM - Prénom",null,null,null,null,null,null,null,null,"Cla",null,"Licence",null,null,"NOM - Prénom",null,null,null,null,null,null,null,null,"Cla.",null,null,null,"Saisir les autres N° de licence"]
[null,null,null,"A",{"$f":"IF(ISBLANK(A9),\" \",VLOOKUP(A9,BDD,2,FALSE))","v":" "},null,null,null,null,null,null,null,null,{"$f":"IF(ISBLANK(A9),\" \",VLOOKUP(A9,BDD,3,FALSE))","v":" "},null,null,null,"X",{"$f":"IF(ISBLANK(O9),\" \",VLOOKUP(O9,BDD,2,FALSE))","v":" "},null,null,null,null,null,null,null,null,{"$f":"IF(ISBLANK(O9),\" \",VLOOKUP(O9,BDD,3,FALSE))","v":" "},null,null,null,"Pour les WO, saisir 0 en N° de licence"]
[null,null,null,"B",{"$f":"IF(ISBLANK(A10),\" \",VLOOKUP(A10,BDD,2,FALSE))","v":" "},null,null,null,null,null,null,null,null,{"$f":"IF(ISBLANK(A10),\" \",VLOOKUP(A10,BDD,3,FALSE))","v":" "},null,null,null,"Y",{"$f":"IF(ISBLANK(O10),\" \",VLOOKUP(O10,BDD,2,FALSE))","v":" "},null,null,null,null,null,null,null,null,{"$f":"IF(ISBLANK(O10),\" \",VLOOKUP(O10,BDD,3,FALSE))","v":" "},null,null,null,"Saisir les scores sauf pour les W0 (pour les W0, cliquer sur le boutton Scores W0 après avoir saisi les autres scores)"]
[null,null,null,"C",{"$f":"IF(ISBLANK(A11),\" \",VLOOKUP(A11,BDD,2,FALSE))","v":" "},null,null,null,null,null,null,null,null,{"$f":"IF(ISBLANK(A11),\" \",VLOOKUP(A11,BDD,3,FALSE))","v":" "},null,null,null,"Z",{"$f":"IF(ISBLANK(O11),\" \",VLOOKUP(O11,BDD,2,FALSE))","v":" "},null,null,null,null,null,null,null,null,{"$f":"IF(ISBLANK(O11),\" \",VLOOKUP(O11,BDD,3,FALSE))","v":" "},null,null,null,"Si le N° de licence n'est pas reconnu, il faut l'indiquer lors de l'envoi de la feuille de match en précisant nouveau joueur = Nom, Prénom, N° de licence, Club et son classement si celui-ci est connu"]
[]
[null,null,"Scores",null,null,{"$f":"IF(ISBLANK(A7),\" \",A7&\" \"&J7&\" \")","v":"0 1 "},null,null,null,null,null,null,null,null,"ABC",null,null,null,"XYZ",{"$f":"IF(ISBLANK(O7),\" \",O7&\" \"&X7&\" \")","v":"0 1 "},null,null,null,null,null,null,null,null,null,null,null,"Quand la saisie est terminée, cliquer sur le boutton Enregistrer Feuille de Match même icomplète (joueurs manquants) et la feuille de macth s'enregistre dans le même répertoire où se trouve le fichier feuille de match"]
[null,null,null,null,null,{"$f":"E9","v":" "},null,null,null,null,null,null,null,null,"A",{"$f":"IF(A14=\"\",\"\",IF(AND(A14=-0.001,B14=-0.001,C14=-0.001),$C$300,IF(COUNTIF(A14:E14,\">=0\")=$B$304,$A$300,$B$300)))","v":""},null,{"$f":"IF(A14=\"\",\"\",IF(AND(A14=0.001,B14=0.001,C14=0.001),$C$300,IF(COUNTIF(A14:E14,\"<0\")=$B$304,$A$300,$B$300)))","v":""},"X",{"$f":"S9","v":" "}]
[null,null,null,null,null,{"$f":"E10","v":" "},null,null,null,null,null,null,null,null,"B",{"$f":"IF(A15=\"\",\"\",IF(AND(A15=-0.001,B15=-0.001,C15=-0.001),$C$300,IF(COUNTIF(A15:E15,\">=0\")=$B$304,$A$300,$B$300)))","v":""},null,{"$f":"IF(A15=\"\",\"\",IF(AND(A15=0.001,B15=0.001,C15=0.001),$C$300,IF(COUNTIF(A15:E15,\"<0\")=$B$304,$A$300,$B$300)))","v":""},"Y",{"$f":"S10","v":" "},null,null,null,null,null,null,null,null,null,null,null,"Pour saisir une nouvelle feuille de match, fermer Excel puis ouvrez de nouveau la feuille de match"]
[null,null,null,null,null,{"$f":"E11","v":" "},null,null,null,null,null,null,null,null,"C",{"$f":"IF(A16=\"\",\"\",IF(AND(A16=-0.001,B16=-0.001,C16=-0.001),$C$300,IF(COUNTIF(A16:E16,\">=0\")=$B$304,$A$300,$B$300)))","v":""},null,"","Z",{"$f":"S11","v":" "}]
[null,null,null,null,null,{"$f":"E10","v":" "},null,null,null,null,null,null,null,null,"B","",null,"","X",{"$f":"S9","v":" "},null,null,null,null,null,null,null,null,null,null,null,"VISUALISATION DES NUMEROS DE LICENCES"]
[null,null,null,null,null,{"$f":"IF(ISBLANK(N18),\" \",VLOOKUP(N18,Double,2,FALSE))","v":"  -  "},null,null,null,null,null,null,null,1,"ABC","",null,"","XYZ",{"$f":"IF(ISBLANK(AB18),\" \",VLOOKUP(AB18,Double,3,FALSE))","v":"  -  "},null,null,null,null,null,null,null,1,null,null,null,"Club",null,null,null,"Club"]
[null,null,null,null,null,{"$f":"E9","v":" "},null,null,null,null,null,null,null,null,"A","",null,"","Z",{"$f":"S11","v":" "},null,null,null,null,null,null,null,null,null,null,null,{"$f":"IF(ISBLANK(G7),\" \",VLOOKUP(G7,ordreclubs,2,FALSE))","v":0},null,null,null,{"$f":"IF(ISBLANK(U7),\" \",VLOOKUP(U7,ordreclubs,2,FALSE))","v":0}]
[null,null,null,null,null,{"$f":"E11","v":" "},null,null,null,null,null,null,null,null,"C","",null,"","Y",{"$f":"S10","v":" "},null,null,null,null,null,null,null,null,null,null,null,{"$f":"IF(ISBLANK(Feuil5!AF20),\" \",Feuil5!AF20)","v":" "},{"$f":"IF(ISBLANK(Feuil5!AG20),\" \",Feuil5!AG20)","v":" "},null,null,{"$f":"IF(ISBLANK(Feuil5!AJ20),\" \",Feuil5!AJ20)","v":" "},{"$f":"IF(ISBLANK(Feuil5!AK20),\" \",Feuil5!AK20)","v":" "}]
{"$rows_left_out":285}
{"sheet":"Feuil2","index":1,"n_rows":38,"n_cols":21,"rows_kept":38,"cut":false,"hidden":false,"merged":[]}
[null,"Division","Phase","Journée","date","Limite de jeu","Limite envoi","Liste des clubs","N° équipe",null,null,"Liste des lieux",null,"Horaires",null,null,"Nom double"]
[null,1,1,1,"2023-09-28",{"$f":"DATE(YEAR(E2),MONTH(E2),DAY(E2)+28)","v":"2023-10-26"},{"$f":"IF(ISBLANK(E2),\" \",DATE(YEAR(E2),MONTH(E2),DAY(E2)+7))","v":"2023-10-05"},null,1,null,1,"75005 Paris, 3, quai Saint Bernard",1,"17H30",null,null,{"$f":"IF(ISBLANK(Feuil1!A9),\" \",VLOOKUP(Feuil1!A9,BDD,2,FALSE))","v":" "},{"$f":"IF(ISBLANK(Feuil1!O9),\" \",VLOOKUP(Feuil1!O9,BDD,2,FALSE))","v":" "},null,1]
[null,2,2,2,"2023-10-12","2023-11-09",{"$f":"IF(ISBLANK(E3),\" \",DATE(YEAR(E3),MONTH(E3),DAY(E3)+7))","v":"2023-10-19"},"AC BB",2,null,2,"75005 Paris, Salle Lucien GAUDIN 4, Jardin du quai Saint Bernard",2,"17H35",null,null,{"$f":"IF(ISBLANK(Feuil1!A10),\" \",VLOOKUP(Feuil1!A10,BDD,2,FALSE))","v":" "},{"$f":"IF(ISBLANK(Feuil1!O10),\" \",VLOOKUP(Feuil1!O10,BDD,2,FALSE))","v":" "},null,2,"AC BB"]
[null,3,"BAR",3,"2023-11-16","2023-12-14","2023-11-23","AS ARENES",3,null,3,"75009 Paris, Gymnase GAUGUIN 33 rue Milton",3,"17H40",null,null,{"$f":"IF(ISBLANK(Feuil1!A11),\" \",VLOOKUP(Feuil1!A11,BDD,2,FALSE))","v":" "},{"$f":"IF(ISBLANK(Feuil1!O11),\" \",VLOOKUP(Feuil1!O11,BDD,2,FALSE))","v":" "},null,3,"AS ARENES"]
[null,null,null,4,"2023-11-30","2023-12-28","2023-12-07","AS DILA",4,null,4,"75010 Paris, 155 avenue Parmentier",4,"17H45",null,null,null,null,null,4,"AS DILA"]
[null,null,null,5,"2023-12-14","2024-01-11","2023-12-21","ASCE",5,null,5,"75013 Paris, 25 avenue de la porte d'Ivry (salle spécifique)",5,"17H50",null,"Double",null,null,null,5,"ASCE"]
[null,null,null,6,"2024-01-11","2024-02-08","2024-01-18","CPS X",6,null,6,"75015 Paris, 13 rue du général Guillaumat",6,"17H55",null,1,{"$f":"IF(AND(Feuil1!A18=-0.001,Feuil1!B18=-0.001,Feuil1!C18=-0.001),\"WO  \",PROPER(Q2&\" - \"&Q3))","v":"  -  "},{"$f":"IF(AND(Feuil1!A18=0.001,Feuil1!B18=0.001,Feuil1!C18=0.001),\"WO  \",PROPER(R2&\" - \"&R3))","v":"  -  "},null,6,"CPS X"]
[null,null,null,7,"2024-01-25",{"$f":"E8","v":"2024-01-25"},"2024-02-01","ESC XV",null,null,7,"75015 Paris, 62 rue Cambronne",7,"18H00",null,2,{"$f":"IF(AND(Feuil1!A18=-0.001,Feuil1!B18=-0.001,Feuil1!C18=-0.001),\"WO  \",PROPER(Q2&\" - \"&Q4))","v":"  -  "},{"$f":"IF(AND(Feuil1!A18=0.001,Feuil1!B18=0.001,Feuil1!C18=0.001),\"WO  \",PROPER(R2&\" - \"&R4))","v":"  -  "},null,7,"ESC XV"]
[null,null,null,null,null,null,null,"PING SF",null,null,8,"91160 Longjumeau, Gymnase St Exupéry rue Maryse Bastié",8,"18H05",null,3,{"$f":"IF(AND(Feuil1!A18=-0.001,Feuil1!B18=-0.001,Feuil1!C18=-0.001),\"WO  \",PROPER(Q3&\" - \"&Q4))","v":"  -  "},{"$f":"IF(AND(Feuil1!A18=0.001,Feuil1!B18=0.001,Feuil1!C18=0.001),\"WO  \",PROPER(R3&\" - \"&R4))","v":"  -  "},null,8,"PING SF"]
[null,null,null,8,"2024-02-29",{"$f":"E10","v":"2024-02-29"},{"$f":"IF(ISBLANK(E10),\" \",DATE(YEAR(E10),MONTH(E10),DAY(E10)+7))","v":"2024-03-07"},"SPORTS ET LOISIRS CGI",null,null,9,"92100 Boulogne Billancourt, 165 rue du Vieux Pont de Sèvres",9,"18H10",null,null,null,null,null,9,"SPORTS ET LOISIRS CGI"]
[null,null,null,9,"2024-03-21","2024-04-18","2024-03-28","US CORG",null,null,10,"92220 Bagneux, 11 avenue Jean Jaurès",10,"18H15",null,null,null,null,null,10,"US CORG"]
[null,null,null,10,"2024-03-28","2024-04-25","2024-04-04",null,null,null,11,"93130 Noisy le Sec, 6 rue de la Gare",11,"18H20",null,null,null,null,null,11]
[null,null,null,11,"2024-04-04","2024-05-02","2024-04-11",null,null,null,12,"94320 Thiais, Palais omnisport de Thiais Place Vincent Van Gogh",12,"18H25",null,null,null,null,null,12]
[null,null,null,12,"2024-04-05","2024-05-03","2024-04-12",null,null,null,13,"94800 Villejuif, 54 avenue de la République (salle des fêtes du groupe hospitalier Paul GUIRAUD)",13,"18H30"]
[null,null,null,13,"2024-05-16",{"$f":"DATE(YEAR(E16),MONTH(E16),DAY(E16)-1)","v":"2024-05-22"},"2024-05-23",null,null,null,14,"95747 Roissy CDG, RDC Bât 4503 Route de l'Arpenteur Zone Entretien",14,"18H35"]
[null,null,null,14,"2024-05-23",{"$f":"E16","v":"2024-05-23"},"2024-05-30",null,null,null,null,null,15,"18H40"]
[null,null,null,15,"2024-05-30",{"$f":"E17","v":"2024-05-30"},"2022-06-20",null,null,null,null,null,16,"18H45"]
[null,null,null,"BAR","2024-05-30",{"$f":"E18","v":"2024-05-30"},"2024-06-06",null,null,null,null,null,17,"18H50"]
[null,null,null,17,"-",{"$f":"E19","v":"-"},null,null,null,null,null,null,18,"18H55"]
[null,null,null,18,"-",{"$f":"E20","v":"-"},null,null,null,null,null,null,19,"19H00"]
{"$rows_left_out":19}
{"sheet":"Feuil3","index":2,"n_rows":204,"n_cols":10,"rows_kept":204,"cut":false,"hidden":false,"merged":[]}
["","N° de licence","NOM - Prénom","Classement","Club",{"$f":"B1","v":"N° de licence"},null,"NOM - Prénom","N° de licence","Club"]
[null,"0180313","CHAPUIS Alexandre",80,"ASCE",{"$f":"B2","v":"0180313"},null,"CHAPUIS Alexandre","0180313","ASCE"]
[null,"0180317","BAILLY Laurent",55,"ASCE","0180317",null,"BAILLY Laurent","0180317","ASCE"]
[null,"0180318","MERELLE Jacques",80,"ASCE","0180318",null,"MERELLE Jacques","0180318","ASCE"]
[null,"0180319","FERGUEN Lakhdar",55,"ASCE","0180319",null,"FERGUEN Lakhdar","0180319","ASCE"]
[null,"0180320","GAROT Loïc",20,"ASCE","0180320",null,"GAROT Loïc","0180320","ASCE"]
[null,"0180323","LY Estelle",80,"ASCE","0180323",null,"LY Estelle","0180323","ASCE"]
[null,"0180326","THISSE Claude",60,"ASCE","0180326",null,"THISSE Claude","0180326","ASCE"]
[null,"0180328","HUOI Trang Meng",40,"ASCE","0180328",null,"HUOI Trang Meng","0180328","ASCE"]
[null,"0180329","ARNOUT Frédéric",50,"ASCE","0180329",null,"ARNOUT Frédéric","0180329","ASCE"]
[null,"0181726","PINET Alain",95,"AS ARENES","0181726",null,"PINET Alain","0181726","AS ARENES"]
[null,"0181731","AGOSTINIS Raphaël",65,"AS ARENES","0181731",null,"AGOSTINIS Raphaël","0181731","AS ARENES"]
[null,"0181732","PETITJEAN Stéphane",95,"AS ARENES","0181732",null,"PETITJEAN Stéphane","0181732","AS ARENES"]
[null,"0181749","JEANJEAN Christian",90,"AS ARENES","0181749",null,"JEANJEAN Christian","0181749","AS ARENES"]
[null,"0181759","MARCEROU Philippe",55,"AS ARENES","0181759",null,"MARCEROU Philippe","0181759","AS ARENES"]
[null,"0181768","SIMON Charles",80,"AS ARENES","0181768",null,"SIMON Charles","0181768","AS ARENES"]
[null,"0181820","RIOU Anthony",65,"AS ARENES","0181820",null,"RIOU Anthony","0181820","AS ARENES"]
[null,"0182829","MAMOU Samuel",40,"SPORTS ET LOISIRS CGI","0182829",null,"MAMOU Samuel","0182829","SPORTS ET LOISIRS CGI"]
[null,"0182836","DECOURTY Fabien",80,"SPORTS ET LOISIRS CGI","0182836",null,"DECOURTY Fabien","0182836","SPORTS ET LOISIRS CGI"]
[null,"0182839","PEREZ Pierre",40,"SPORTS ET LOISIRS CGI","0182839",null,"PEREZ Pierre","0182839","SPORTS ET LOISIRS CGI"]
{"$rows_left_out":185}
{"sheet":"Feuil4","index":3,"n_rows":26,"n_cols":126,"rows_kept":26,"cut":false,"hidden":false,"merged":[]}
["Fédération Sportive et Gymnique du Travail",null,null,null,null,null,null,null,null,null,null,null,null,null,null,null,null,null,null,null,null,null,null,null,null,null,null,null,null,null,null,null,null,null,null,null,null,null,null,null,null,null,null,null,null,null,null,null,null,null,null,null,null,null,null,null,null,null,null,null,null,null,null,null,null,null,null,null,null,null,null,null,null,null,null,null,null,null,null,null,null,null,null,null,null,null,null,null,null,null,null,null,null,null,null,null,null,null,null,null,null,null,null,null,null,null,null,null,null,null,null,null,null,null,null,null,null,null,null,null,null,null,null,null,null,"Date version = 28/09/2023"]
["Championnat par équipes",null,null,null,null,null,null,null,null,null,"D"]
[null,"Date :",null,null,null,null,null,null,null,"Heure officielle :"]
[null,"Date réelle :",null,null,null,null,null,null,null,"Heure réelle :",null,null,null,null,"Division :",null,null,null,"Phase :",null,null,null,"Journée :"]
[null,"Lieu :",null,null,null,null,null,null,null,null,null,null,null,null,null,null,null,null,null,null,null,null,null,null,null,null,null,{"$f":"HYPERLINK(\"mailto:fdm-tennis-de-table@fsgt75.org\",\"fdm-tennis-de-table@fsgt75.org\")","v":"fdm-tennis-de-table@fsgt75.org"}]
[]
[null,null,"Club :",null,null,null,null,null,"N°",null,null,null,null,null,null,null,"Club :",null,null,null,null,null,"N°"]
[null,"Licence",null,null,"NOM - Prénom",null,null,null,null,null,null,null,null,"Cla",null,"Licence",null,null,"NOM - Prénom",null,null,null,null,null,null,null,null,"Cla."]
[null,null,null,"A",null,null,null,null,null,null,null,null,null,null,null,null,null,"X"]
[null,null,null,"B",null,null,null,null,null,null,null,null,null,null,null,null,null,"Y"]
[null,null,null,"C",null,null,null,null,null,null,null,null,null,null,null,null,null,"Z"]
[]
[null,null,"Scores",null,null,null,null,null,null,null,null,null,null,null,"ABC",null,null,null,"XYZ"]
[null,null,null,null,null,null,null,null,null,null,null,null,null,null,"A",null,null,null,"X"]
[null,null,null,null,null,null,null,null,null,null,null,null,null,null,"B",null,null,null,"Y"]
[null,null,null,null,null,null,null,null,null,null,null,null,null,null,"C",null,null,null,"Z"]
[null,null,null,null,null,null,null,null,null,null,null,null,null,null,"B",null,null,null,"X"]
[null,null,null,null,null,null,null,null,null,null,null,null,null,null,"ABC",null,null,null,"XYZ"]
[null,null,null,null,null,null,null,null,null,null,null,null,null,null,"A",null,null,null,"Z"]
[null,null,null,null,null,null,null,null,null,null,null,null,null,null,"C",null,null,null,"Y"]
{"$rows_left_out":7}
{"sheet":"Feuil5","index":4,"n_rows":19,"n_cols":36,"rows_kept":19,"cut":false,"hidden":false,"merged":[[16,31,16,38]]}
[]
[]
[]
[]
[]
[]
[]
[]
[]
[]
[]
[]
[]
[]
[]
[]
[]
[null,null,null,null,null,null,null,null,null,null,null,null,null,null,null,null,null,null,null,null,null,null,null,null,null,null,null,null,null,null,null,"Club",null,null,null,"Club"]
[null,null,null,null,null,null,null,null,null,null,null,null,null,null,null,null,null,null,null,null,null,null,null,null,null,null,null,null,null,null,null,{"$f":"IF(ISBLANK(Feuil1!G7),\" \",VLOOKUP(Feuil1!G7,ordreclubs,2,FALSE))","v":0},null,null,null,{"$f":"IF(ISBLANK(Feuil1!U7),\" \",VLOOKUP(Feuil1!U7,ordreclubs,2,FALSE))","v":0}]